Target
S-adenosylmethionine decarboxylase proenzyme
Ligand
BDBM50367076
Substrate
Meas. Tech.
ChEMBL_197049 (CHEMBL806288)
Ki
1000000±n/a nM
Citation
 Kolb, MDanzin, CBarth, JClaverie, N Synthesis and biochemical properties of chemically stable product analogues of the reaction catalyzed by S-adenosyl-L-methionine decarboxylase. J Med Chem 25:550-6 (1982)  
Target
Name:
S-adenosylmethionine decarboxylase proenzyme
Synonyms:
Amd1 S-adenosylmethionine decarboxylase 1
Type:
PROTEIN
Mol. Mass.:
38134.93
Organism:
Rattus norvegicus
Description:
ChEMBL_197052
Residue:
333
  
Inhibitor
Name:
BDBM50367076
Synonyms:
CHEMBL611588
Type:
Small organic molecule
Emp. Form.:
C11H16N8O3
Mol. Mass.:
308.2965
SMILES:
[#7]\[#6](-[#7])=[#7]/[#6]-[#6@H]-1-[#8]-[#6](-[#6@H](-[#8])-[#6@@H]-1-[#8])-n1cnc2c(-[#7])ncnc12
: