Target
S-adenosylmethionine decarboxylase proenzyme
Ligand
BDBM50291721
Substrate
Meas. Tech.
ChEMBL_197052 (CHEMBL806291)
Ki
3000±n/a nM
Citation
 Kolb, MDanzin, CBarth, JClaverie, N Synthesis and biochemical properties of chemically stable product analogues of the reaction catalyzed by S-adenosyl-L-methionine decarboxylase. J Med Chem 25:550-6 (1982)  
Target
Name:
S-adenosylmethionine decarboxylase proenzyme
Synonyms:
Amd1 S-adenosylmethionine decarboxylase 1
Type:
PROTEIN
Mol. Mass.:
38134.93
Organism:
Rattus norvegicus
Description:
ChEMBL_197052
Residue:
333
  
Inhibitor
Name:
BDBM50291721
Synonyms:
(3-Amino-propyl)-[5-(6-amino-purin-9-yl)-3,4-dihydroxy-tetrahydro-furan-2-ylmethyl]-methyl-sulfonium | CHEMBL538110
Type:
Small organic molecule
Emp. Form.:
C14H23N6O3S
Mol. Mass.:
355.435
SMILES:
C[S+](CCCN)C[C@H]1OC([C@H](O)[C@@H]1O)n1cnc2c(N)ncnc12
: