Target
S-adenosylmethionine decarboxylase proenzyme
Ligand
BDBM50090850
Substrate
Meas. Tech.
ChEMBL_197052 (CHEMBL806291)
Ki
200000±n/a nM
Citation
 Kolb, MDanzin, CBarth, JClaverie, N Synthesis and biochemical properties of chemically stable product analogues of the reaction catalyzed by S-adenosyl-L-methionine decarboxylase. J Med Chem 25:550-6 (1982)  
Target
Name:
S-adenosylmethionine decarboxylase proenzyme
Synonyms:
Amd1 S-adenosylmethionine decarboxylase 1
Type:
PROTEIN
Mol. Mass.:
38134.93
Organism:
Rattus norvegicus
Description:
ChEMBL_197052
Residue:
333
  
Inhibitor
Name:
BDBM50090850
Synonyms:
(2R,3S,4R,5R)-2-Aminomethyl-5-(6-amino-purin-9-yl)-tetrahydro-furan-3,4-diol 5'-amino-5'-deoxyadenosine | CHEMBL302376
Type:
Small organic molecule
Emp. Form.:
C10H14N6O3
Mol. Mass.:
266.2566
SMILES:
NC[C@H]1O[C@H]([C@H](O)[C@@H]1O)n1cnc2c(N)ncnc12
: