Target
S-adenosylmethionine decarboxylase proenzyme
Ligand
BDBM50367080
Substrate
Meas. Tech.
ChEBML_197049
Ki
600000±n/a nM
Citation
 Kolb, MDanzin, CBarth, JClaverie, N Synthesis and biochemical properties of chemically stable product analogues of the reaction catalyzed by S-adenosyl-L-methionine decarboxylase. J Med Chem 25:550-6 (1982)  
Target
Name:
S-adenosylmethionine decarboxylase proenzyme
Synonyms:
Amd1 S-adenosylmethionine decarboxylase 1
Type:
PROTEIN
Mol. Mass.:
38134.93
Organism:
Rattus norvegicus
Description:
ChEMBL_197052
Residue:
333
  
Inhibitor
Name:
BDBM50367080
Synonyms:
CHEMBL610142
Type:
Small organic molecule
Emp. Form.:
C14H23N7O3
Mol. Mass.:
337.3775
SMILES:
CNCCCNC[C@H]1OC([C@H](O)[C@@H]1O)n1cnc2c(N)ncnc12
: