Target
S-adenosylmethionine decarboxylase proenzyme
Ligand
BDBM50366942
Substrate
Meas. Tech.
ChEBML_197049
Ki
2000±n/a nM
Citation
 Kolb, MDanzin, CBarth, JClaverie, N Synthesis and biochemical properties of chemically stable product analogues of the reaction catalyzed by S-adenosyl-L-methionine decarboxylase. J Med Chem 25:550-6 (1982)  
Target
Name:
S-adenosylmethionine decarboxylase proenzyme
Synonyms:
Amd1 S-adenosylmethionine decarboxylase 1
Type:
PROTEIN
Mol. Mass.:
38134.93
Organism:
Rattus norvegicus
Description:
ChEMBL_197052
Residue:
333
  
Inhibitor
Name:
BDBM50366942
Synonyms:
CHEMBL540135
Type:
Small organic molecule
Emp. Form.:
C12H18N5O3S
Mol. Mass.:
312.367
SMILES:
C[S+](C)C[C@H]1O[C@H]([C@H](O)[C@@H]1O)n1cnc2c(N)ncnc12
: