Target
Thymidine kinase, cytosolic
Ligand
BDBM50028574
Substrate
Meas. Tech.
ChEMBL_123825 (CHEMBL734263)
Ki
36000±n/a nM
Citation
 Hampton, AChawla, RRKappler, F Species- or isozyme-specific enzyme inhibitors. 5. Differential effects of thymidine substituents on affinity for rat thymidine kinase isozymes. J Med Chem 25:644-9 (1982)  
Target
Name:
Thymidine kinase, cytosolic
Synonyms:
KITH_RAT Tk-1 | Tk1
Type:
PROTEIN
Mol. Mass.:
13514.16
Organism:
Rattus norvegicus
Description:
ChEMBL_208200
Residue:
121
  
Inhibitor
Name:
BDBM50028574
Synonyms:
1-(4-Ethoxy-5-hydroxymethyl-tetrahydro-furan-2-yl)-5-methyl-1H-pyrimidine-2,4-dione | CHEMBL3143685
Type:
Small organic molecule
Emp. Form.:
C12H18N2O5
Mol. Mass.:
270.2817
SMILES:
CCO[C@H]1C[C@@H](O[C@@H]1CO)n1cc(C)c(=O)[nH]c1=O
: