Target
Thymidine kinase, cytosolic
Ligand
BDBM50028576
Substrate
Meas. Tech.
ChEBML_123825
Ki
40000±n/a nM
Citation
 Hampton, AChawla, RRKappler, F Species- or isozyme-specific enzyme inhibitors. 5. Differential effects of thymidine substituents on affinity for rat thymidine kinase isozymes. J Med Chem 25:644-9 (1982)  
Target
Name:
Thymidine kinase, cytosolic
Synonyms:
KITH_RAT Tk-1 | Tk1
Type:
PROTEIN
Mol. Mass.:
13514.16
Organism:
Rattus norvegicus
Description:
ChEMBL_208200
Residue:
121
  
Inhibitor
Name:
BDBM50028576
Synonyms:
1-(5-Ethylaminomethyl-4-hydroxy-tetrahydro-furan-2-yl)-5-methyl-1H-pyrimidine-2,4-dione | CHEMBL156488
Type:
Small organic molecule
Emp. Form.:
C12H19N3O4
Mol. Mass.:
269.297
SMILES:
CCNCC1OC(CC1O)n1cc(C)c(=O)[nH]c1=O
: