Target
Dihydrofolate reductase
Ligand
BDBM50028605
Substrate
Meas. Tech.
ChEBML_54601
Ki
0.003000±n/a nM
Citation
 Piper, JRMcCaleb, GSMontgomery, JAKisliuk, RLGaumont, YSirotnak, FM 10-Propargylaminopterin and alkyl homologues of methotrexate as inhibitors of folate metabolism. J Med Chem 25:877-80 (1982)  
Target
Name:
Dihydrofolate reductase
Synonyms:
DYR_MOUSE | Dhfr
Type:
Enzyme
Mol. Mass.:
21608.82
Organism:
Mus musculus (Mouse)
Description:
Residue:
187
  
Inhibitor
Name:
BDBM50028605
Synonyms:
2-{4-[(2,4-Diamino-pteridin-6-ylmethyl)-propyl-amino]-benzoylamino}-pentanedioic acid | CHEMBL354055
Type:
Small organic molecule
Emp. Form.:
C22H26N8O5
Mol. Mass.:
482.4924
SMILES:
CCCN(Cc1cnc2nc(N)nc(N)c2n1)c1ccc(cc1)C(=O)NC(CCC(O)=O)C(O)=O
: