Target
Transporter
Ligand
BDBM50367177
Substrate
Meas. Tech.
ChEBML_177242
IC50
40±n/a nM
Citation
 Welch, WMKraska, ARSarges, RKoe, BK Nontricyclic antidepressant agents derived from cis- and trans-1-amino-4-aryltetralins. J Med Chem 27:1508-15 (1984)  
Target
Name:
Transporter
Synonyms:
Monoamine transporters; Norepininephrine & dopamine | Norepinephrine Monoamine transporters
Type:
PROTEIN
Mol. Mass.:
66787.87
Organism:
Rattus norvegicus
Description:
ChEMBL_1463061
Residue:
597
  
Inhibitor
Name:
BDBM50367177
Synonyms:
CHEMBL1743845
Type:
Small organic molecule
Emp. Form.:
C18H19Cl2N
Mol. Mass.:
320.256
SMILES:
CN(C)[C@@H]1CC[C@@H](c2ccc(Cl)c(Cl)c2)c2ccccc12
: