Target
Transporter
Ligand
BDBM50367186
Substrate
Meas. Tech.
ChEBML_177242
IC50
2550±n/a nM
Citation
 Welch, WMKraska, ARSarges, RKoe, BK Nontricyclic antidepressant agents derived from cis- and trans-1-amino-4-aryltetralins. J Med Chem 27:1508-15 (1984)  
Target
Name:
Transporter
Synonyms:
Monoamine transporters; Norepininephrine & dopamine | Norepinephrine Monoamine transporters
Type:
PROTEIN
Mol. Mass.:
66787.87
Organism:
Rattus norvegicus
Description:
ChEMBL_1463061
Residue:
597
  
Inhibitor
Name:
BDBM50367186
Synonyms:
CHEMBL1788367
Type:
Small organic molecule
Emp. Form.:
C18H18F3N
Mol. Mass.:
305.3374
SMILES:
CN[C@H]1CC[C@@H](c2cccc(c2)C(F)(F)F)c2ccccc12
: