Target
Sodium-dependent dopamine transporter
Ligand
BDBM50367197
Substrate
Meas. Tech.
ChEBML_177229
IC50
100±n/a nM
Citation
 Welch, WMKraska, ARSarges, RKoe, BK Nontricyclic antidepressant agents derived from cis- and trans-1-amino-4-aryltetralins. J Med Chem 27:1508-15 (1984)  
Target
Name:
Sodium-dependent dopamine transporter
Synonyms:
DA transporter SC6A3_RAT Sodium-dependent dopamine transporter | Sodium-dependent dopamine transporter (DAT)
Type:
Multi-pass membrane protein
Mol. Mass.:
68749.45
Organism:
Rattus norvegicus (rat)
Description:
P23977
Residue:
619
  
Inhibitor
Name:
BDBM50367197
Synonyms:
CHEMBL1788366
Type:
Small organic molecule
Emp. Form.:
C17H18ClN
Mol. Mass.:
271.785
SMILES:
CN[C@@H]1CC[C@@H](c2ccc(Cl)cc2)c2ccccc12
: