Target
Transporter
Ligand
BDBM50028083
Substrate
Meas. Tech.
ChEBML_177242
IC50
19±n/a nM
Citation
 Welch, WMKraska, ARSarges, RKoe, BK Nontricyclic antidepressant agents derived from cis- and trans-1-amino-4-aryltetralins. J Med Chem 27:1508-15 (1984)  
Target
Name:
Transporter
Synonyms:
Monoamine transporters; Norepininephrine & dopamine | Norepinephrine Monoamine transporters
Type:
PROTEIN
Mol. Mass.:
66787.87
Organism:
Rattus norvegicus
Description:
ChEMBL_1463061
Residue:
597
  
Inhibitor
Name:
BDBM50028083
Synonyms:
CHEMBL37714 [4-(4-Chloro-phenyl)-1,2,3,4-tetrahydro-naphthalen-1-yl]-methyl-amine, HCl
Type:
Small organic molecule
Emp. Form.:
C17H18ClN
Mol. Mass.:
271.785
SMILES:
CN[C@@H]1CC[C@@H](c2ccc(Cl)cc2)c2ccccc12
: