Target
Sodium-dependent serotonin transporter
Ligand
BDBM50028076
Substrate
Meas. Tech.
ChEBML_177196
IC50
70±n/a nM
Citation
 Welch, WMKraska, ARSarges, RKoe, BK Nontricyclic antidepressant agents derived from cis- and trans-1-amino-4-aryltetralins. J Med Chem 27:1508-15 (1984)  
Target
Name:
Sodium-dependent serotonin transporter
Synonyms:
5-HT Transporter 5HT transporter Anandamid membrane transporter, AMT Monoamine transporters; Norepinephrine & serotonin Slc6a4 Sodium-dependent serotonin transporter (SERT) | imipramine receptor
Type:
Multi-pass membrane protein
Mol. Mass.:
70168.43
Organism:
Rattus norvegicus (rat)
Description:
P31652
Residue:
630
  
Inhibitor
Name:
BDBM50028076
Synonyms:
CHEMBL39354 | [4-(3,4-Dichloro-phenyl)-1,2,3,4-tetrahydro-naphthalen-1-yl]-dimethyl-amine, CH3SO3H
Type:
Small organic molecule
Emp. Form.:
C18H19Cl2N
Mol. Mass.:
320.256
SMILES:
CN(C)[C@H]1CC[C@@H](c2ccc(Cl)c(Cl)c2)c2ccccc12
: