Target
Sodium-dependent dopamine transporter
Ligand
BDBM50367195
Substrate
Meas. Tech.
ChEBML_177229
IC50
5600±n/a nM
Citation
 Welch, WMKraska, ARSarges, RKoe, BK Nontricyclic antidepressant agents derived from cis- and trans-1-amino-4-aryltetralins. J Med Chem 27:1508-15 (1984)  
Target
Name:
Sodium-dependent dopamine transporter
Synonyms:
DA transporter SC6A3_RAT Sodium-dependent dopamine transporter | Sodium-dependent dopamine transporter (DAT)
Type:
Multi-pass membrane protein
Mol. Mass.:
68749.45
Organism:
Rattus norvegicus (rat)
Description:
P23977
Residue:
619
  
Inhibitor
Name:
BDBM50367195
Synonyms:
CHEMBL1743872
Type:
Small organic molecule
Emp. Form.:
C18H20ClN
Mol. Mass.:
285.811
SMILES:
CN(C)[C@H]1CC[C@@H](c2ccc(Cl)cc2)c2ccccc12
: