Target
Sodium-dependent serotonin transporter
Ligand
BDBM50367186
Substrate
Meas. Tech.
ChEBML_177196
IC50
250±n/a nM
Citation
 Welch, WMKraska, ARSarges, RKoe, BK Nontricyclic antidepressant agents derived from cis- and trans-1-amino-4-aryltetralins. J Med Chem 27:1508-15 (1984)  
Target
Name:
Sodium-dependent serotonin transporter
Synonyms:
5-HT Transporter 5HT transporter Anandamid membrane transporter, AMT Monoamine transporters; Norepinephrine & serotonin Slc6a4 Sodium-dependent serotonin transporter (SERT) | imipramine receptor
Type:
Multi-pass membrane protein
Mol. Mass.:
70168.43
Organism:
Rattus norvegicus (rat)
Description:
P31652
Residue:
630
  
Inhibitor
Name:
BDBM50367186
Synonyms:
CHEMBL1788367
Type:
Small organic molecule
Emp. Form.:
C18H18F3N
Mol. Mass.:
305.3374
SMILES:
CN[C@H]1CC[C@@H](c2cccc(c2)C(F)(F)F)c2ccccc12
: