Target
Sodium-dependent dopamine transporter
Ligand
BDBM50021238
Substrate
Meas. Tech.
ChEMBL_176345 (CHEMBL783267)
IC50
190±n/a nM
Citation
 Bøgesø, KPChristensen, AVHyttel, JLiljefors, T 3-Phenyl-1-indanamines. Potential antidepressant activity and potent inhibition of dopamine, norepinephrine, and serotonin uptake. J Med Chem 28:1817-28 (1986)  
Target
Name:
Sodium-dependent dopamine transporter
Synonyms:
DA transporter SC6A3_RAT Sodium-dependent dopamine transporter | Sodium-dependent dopamine transporter (DAT)
Type:
Multi-pass membrane protein
Mol. Mass.:
68749.45
Organism:
Rattus norvegicus (rat)
Description:
P23977
Residue:
619
  
Inhibitor
Name:
BDBM50021238
Synonyms:
CHEMBL50635 | [3-(4-Chloro-phenyl)-indan-1-yl]-dimethyl-amine
Type:
Small organic molecule
Emp. Form.:
C17H18ClN
Mol. Mass.:
271.785
SMILES:
CN(C)C1CC(c2ccccc12)c1ccc(Cl)cc1
: