Target
Transporter
Ligand
BDBM50021238
Substrate
Meas. Tech.
ChEMBL_176350 (CHEMBL781943)
IC50
4.4±n/a nM
Citation
 Bøgesø, KPChristensen, AVHyttel, JLiljefors, T 3-Phenyl-1-indanamines. Potential antidepressant activity and potent inhibition of dopamine, norepinephrine, and serotonin uptake. J Med Chem 28:1817-28 (1986)  
Target
Name:
Transporter
Synonyms:
Monoamine transporters; Norepininephrine & dopamine | Norepinephrine Monoamine transporters
Type:
PROTEIN
Mol. Mass.:
66787.87
Organism:
Rattus norvegicus
Description:
ChEMBL_1463061
Residue:
597
  
Inhibitor
Name:
BDBM50021238
Synonyms:
CHEMBL50635 | [3-(4-Chloro-phenyl)-indan-1-yl]-dimethyl-amine
Type:
Small organic molecule
Emp. Form.:
C17H18ClN
Mol. Mass.:
271.785
SMILES:
CN(C)C1CC(c2ccccc12)c1ccc(Cl)cc1
: