Target
Thromboxane-A synthase
Ligand
BDBM50026512
Substrate
Meas. Tech.
ChEBML_207779
IC50
71±n/a nM
Citation
 Kato, KOhkawa, STerao, STerashita, ZNishikawa, K Thromboxane synthetase inhibitors (TXSI). Design, synthesis, and evaluation of a novel series of omega-pyridylalkenoic acids. J Med Chem 28:287-94 (1985)  
Target
Name:
Thromboxane-A synthase
Synonyms:
CYP5 Cytochrome P450 5A1 TBXAS1 TXA synthase TXS Thromboxane A2 Synthase (P450 TxA2) Thromboxane prostanoid Thromboxane-A synthase
Type:
Enzyme
Mol. Mass.:
60524.67
Organism:
Homo sapiens (Human)
Description:
P24557
Residue:
533
  
Inhibitor
Name:
BDBM50026512
Synonyms:
7-Pyridin-3-yl-oct-6-enoic acid | CHEMBL98941
Type:
Small organic molecule
Emp. Form.:
C13H17NO2
Mol. Mass.:
219.2796
SMILES:
C\C(=C\CCCCC(O)=O)c1cccnc1
: