Target
Thromboxane-A synthase
Ligand
BDBM50026510
Substrate
Meas. Tech.
ChEBML_207779
IC50
82±n/a nM
Citation
 Kato, KOhkawa, STerao, STerashita, ZNishikawa, K Thromboxane synthetase inhibitors (TXSI). Design, synthesis, and evaluation of a novel series of omega-pyridylalkenoic acids. J Med Chem 28:287-94 (1985)  
Target
Name:
Thromboxane-A synthase
Synonyms:
CYP5 Cytochrome P450 5A1 TBXAS1 TXA synthase TXS Thromboxane A2 Synthase (P450 TxA2) Thromboxane prostanoid Thromboxane-A synthase
Type:
Enzyme
Mol. Mass.:
60524.67
Organism:
Homo sapiens (Human)
Description:
P24557
Residue:
533
  
Inhibitor
Name:
BDBM50026510
Synonyms:
7-(4-Bromo-phenyl)-7-pyridin-3-yl-hept-6-enoic acid | CHEMBL100755
Type:
Small organic molecule
Emp. Form.:
C18H18BrNO2
Mol. Mass.:
360.245
SMILES:
OC(=O)CCCC\C=C(\c1ccc(Br)cc1)c1cccnc1
: