Target
Thromboxane-A synthase
Ligand
BDBM50026526
Substrate
Meas. Tech.
ChEBML_207779
IC50
30±n/a nM
Citation
 Kato, KOhkawa, STerao, STerashita, ZNishikawa, K Thromboxane synthetase inhibitors (TXSI). Design, synthesis, and evaluation of a novel series of omega-pyridylalkenoic acids. J Med Chem 28:287-94 (1985)  
Target
Name:
Thromboxane-A synthase
Synonyms:
CYP5 Cytochrome P450 5A1 TBXAS1 TXA synthase TXS Thromboxane A2 Synthase (P450 TxA2) Thromboxane prostanoid Thromboxane-A synthase
Type:
Enzyme
Mol. Mass.:
60524.67
Organism:
Homo sapiens (Human)
Description:
P24557
Residue:
533
  
Inhibitor
Name:
BDBM50026526
Synonyms:
2-Methylsulfanyl-7-phenyl-7-pyridin-3-yl-hept-6-enoic acid | CHEMBL98443
Type:
Small organic molecule
Emp. Form.:
C19H21NO2S
Mol. Mass.:
327.441
SMILES:
CSC(CCC\C=C(/c1ccccc1)c1cccnc1)C(O)=O
: