Target
Thymidine kinase, cytosolic
Ligand
BDBM50207303
Substrate
Meas. Tech.
ChEMBL_208005 (CHEMBL872716)
Ki
25000±n/a nM
Citation
 Efange, SMAlessi, EMShih, HCCheng, YCBardos, TJ Synthesis and biological activities of 2-pyrimidinone nucleosides. 2. 5-Halo-2-pyrimidinone 2'-deoxyribonucleosides. J Med Chem 28:904-10 (1985)  
Target
Name:
Thymidine kinase, cytosolic
Synonyms:
KITH_HUMAN | TK1
Type:
PROTEIN
Mol. Mass.:
25476.50
Organism:
Homo sapiens (Human)
Description:
ChEMBL_1333884
Residue:
234
  
Inhibitor
Name:
BDBM50207303
Synonyms:
5-BROMO-2'-DEOXY URIDINE Bromodeoxyuridine cid_6035
Type:
Small organic molecule
Emp. Form.:
C9H11BrN2O5
Mol. Mass.:
307.098
SMILES:
OC[C@H]1O[C@H](C[C@@H]1O)n1cc(Br)c(=O)[nH]c1=O
: