Target
Adenosine receptor A1
Ligand
BDBM50020970
Substrate
Meas. Tech.
ChEMBL_28965 (CHEMBL640605)
IC50
20±n/a nM
Citation
 Hamilton, HWOrtwine, DFWorth, DFBadger, EWBristol, JABruns, RFHaleen, SJSteffen, RP Synthesis of xanthines as adenosine antagonists, a practical quantitative structure-activity relationship application. J Med Chem 28:1071-9 (1985)  
Target
Name:
Adenosine receptor A1
Synonyms:
AA1R_BOVIN ADENOSINE A1 high ADORA1 | Adenosine A1 receptor
Type:
Enzyme Catalytic Domain
Mol. Mass.:
36602.99
Organism:
BOVINE
Description:
ADENOSINE 0 BOVINE::P28190
Residue:
326
  
Inhibitor
Name:
BDBM50020970
Synonyms:
8-(3-Methoxy-phenyl)-1,3-dimethyl-3,7-dihydro-purine-2,6-dione | CHEMBL11439
Type:
Small organic molecule
Emp. Form.:
C14H14N4O3
Mol. Mass.:
286.286
SMILES:
COc1cccc(c1)-c1nc2n(C)c(=O)n(C)c(=O)c2[nH]1
: