Target
Purine nucleoside phosphorylase
Ligand
BDBM50225889
Substrate
Meas. Tech.
ChEMBL_162176 (CHEMBL766696)
IC50
102000±n/a nM
Citation
 Berry, DAGilbertsen, RBCook, PD Synthesis of 8-amino-3-deazaguanine via imidazole precursors. Antitumor activity and inhibition of purine nucleoside phosphorylase. J Med Chem 29:2034-7 (1986)  
Target
Name:
Purine nucleoside phosphorylase
Synonyms:
Inosine phosphorylase NP PNPH_HUMAN | Purine nucleoside phosphorylase (PNPase)
Type:
Enzyme
Mol. Mass.:
32119.53
Organism:
Homo sapiens (Human)
Description:
Residue:
289
  
Inhibitor
Name:
BDBM50225889
Synonyms:
CHEMBL3144008
Type:
Small organic molecule
Emp. Form.:
C10H12N4O5
Mol. Mass.:
268.2261
SMILES:
OC[C@H]1O[C@H]([C@H](O)[C@@H]1O)C1=NNC2C1=NC=NC2=O
: