Target
Purine nucleoside phosphorylase
Ligand
BDBM50200094
Substrate
Meas. Tech.
ChEBML_162176
IC50
5000±n/a nM
Citation
 Berry, DAGilbertsen, RBCook, PD Synthesis of 8-amino-3-deazaguanine via imidazole precursors. Antitumor activity and inhibition of purine nucleoside phosphorylase. J Med Chem 29:2034-7 (1986)  
Target
Name:
Purine nucleoside phosphorylase
Synonyms:
Inosine phosphorylase NP PNPH_HUMAN | Purine nucleoside phosphorylase (PNPase)
Type:
Enzyme
Mol. Mass.:
32119.53
Organism:
Homo sapiens (Human)
Description:
Residue:
289
  
Inhibitor
Name:
BDBM50200094
Synonyms:
2-amino-1,9-dihydro-6H-purin-6-one Gua | guanine
Type:
Small organic molecule
Emp. Form.:
C5H5N5O
Mol. Mass.:
151.1261
SMILES:
Nc1nc2nc[nH]c2c(=O)[nH]1
: