Target
Purine nucleoside phosphorylase
Ligand
BDBM50022243
Substrate
Meas. Tech.
ChEBML_162176
IC50
600±n/a nM
Citation
 Berry, DAGilbertsen, RBCook, PD Synthesis of 8-amino-3-deazaguanine via imidazole precursors. Antitumor activity and inhibition of purine nucleoside phosphorylase. J Med Chem 29:2034-7 (1986)  
Target
Name:
Purine nucleoside phosphorylase
Synonyms:
Inosine phosphorylase NP PNPH_HUMAN | Purine nucleoside phosphorylase (PNPase)
Type:
Enzyme
Mol. Mass.:
32119.53
Organism:
Homo sapiens (Human)
Description:
Residue:
289
  
Inhibitor
Name:
BDBM50022243
Synonyms:
2,8-Diamino-1,9-dihydro-purin-6-one CHEMBL8040
Type:
Small organic molecule
Emp. Form.:
C5H6N6O
Mol. Mass.:
166.1407
SMILES:
Nc1nc2nc(N)[nH]c(=O)c2[nH]1
: