Target
Androgen receptor
Ligand
BDBM50025456
Substrate
Meas. Tech.
ChEBML_36310
IC50
6400±n/a nM
Citation
 Rasmusson, GHReynolds, GFSteinberg, NGWalton, EPatel, GFLiang, TCascieri, MACheung, AHBrooks, JRBerman, C Azasteroids: structure-activity relationships for inhibition of 5 alpha-reductase and of androgen receptor binding. J Med Chem 29:2298-315 (1986)  
Target
Name:
Androgen receptor
Synonyms:
ANDR_RAT Ar Nr3c4 | androgen
Type:
Enzyme
Mol. Mass.:
98219.08
Organism:
Rattus norvegicus (Rat)
Description:
P15207
Residue:
902
  
Inhibitor
Name:
BDBM50025456
Synonyms:
1,4a,6a-Trimethyl-2-oxo-2,4a,4b,5,6,6a,7,8,9,9a,9b,10-dodecahydro-1H-indeno[5,4-f]quinoline-7-carboxylic acid diisopropylamide | CHEMBL572678
Type:
Small organic molecule
Emp. Form.:
C26H40N2O2
Mol. Mass.:
412.608
SMILES:
[H][C@@]12CC[C@H](C(=O)N(C(C)C)C(C)C)[C@@]1(C)CC[C@@]1([H])[C@@]2([H])CC=C2N(C)C(=O)C=C[C@]12C
: