Target
Kappa-type opioid receptor
Ligand
BDBM50021322
Substrate
Meas. Tech.
ChEMBL_145704 (CHEMBL753912)
Kd
179±n/a nM
Citation
 Cheng, AUyeno, EPolgar, WToll, LLawson, JADeGraw, JILoew, GCamerman, ACamerman, N N-substituent modulation of opiate agonist/antagonist activity in resolved 3-methyl-3-(m-hydroxyphenyl)piperidines. J Med Chem 29:531-7 (1986)  
Target
Name:
Kappa-type opioid receptor
Synonyms:
KOR-1 OPIATE Kappa Opioid receptor Ror-d
Type:
G Protein-Coupled Receptor (GPCR)
Mol. Mass.:
42692.90
Organism:
Rattus norvegicus (rat)
Description:
P34975
Residue:
380
  
Inhibitor
Name:
BDBM50021322
Synonyms:
3-(3-Methyl-1-phenethyl-piperidin-3-yl)-phenol CHEMBL150967
Type:
Small organic molecule
Emp. Form.:
C20H25NO
Mol. Mass.:
295.4186
SMILES:
CC1(CCCN(CCc2ccccc2)C1)c1cccc(O)c1
: