Target
Kappa-type opioid receptor
Ligand
BDBM50021328
Substrate
Meas. Tech.
ChEMBL_145702 (CHEMBL753910)
Kd
0.300000±n/a nM
Citation
 Cheng, AUyeno, EPolgar, WToll, LLawson, JADeGraw, JILoew, GCamerman, ACamerman, N N-substituent modulation of opiate agonist/antagonist activity in resolved 3-methyl-3-(m-hydroxyphenyl)piperidines. J Med Chem 29:531-7 (1986)  
Target
Name:
Kappa-type opioid receptor
Synonyms:
KOR-1 OPIATE Kappa Opioid receptor Ror-d
Type:
G Protein-Coupled Receptor (GPCR)
Mol. Mass.:
42692.90
Organism:
Rattus norvegicus (rat)
Description:
P34975
Residue:
380
  
Inhibitor
Name:
BDBM50021328
Synonyms:
3-Cyclopropylmethyl-11-ethyl-8-hydroxy-6-methyl-3,4,5,6-tetrahydro-2H-2,6-methano-benzo[d]azocin-1-one | CHEMBL149414
Type:
Small organic molecule
Emp. Form.:
C19H25NO2
Mol. Mass.:
299.4073
SMILES:
CCC1C2N(CC3CC3)CCC1(C)c1cc(O)ccc1C2=O
: