Target
Dihydrofolate reductase
Ligand
BDBM50016322
Substrate
Meas. Tech.
ChEBML_54595
Ki
0.0053±0.0007 nM
Citation
 Piper, JRMcCaleb, GSMontgomery, JAKisliuk, RLGaumont, YSirotnak, FM Syntheses and antifolate activity of 5-methyl-5-deaza analogues of aminopterin, methotrexate, folic acid, and N10-methylfolic acid. J Med Chem 29:1080-7 (1986)  
Target
Name:
Dihydrofolate reductase
Synonyms:
DYR_MOUSE | Dhfr
Type:
Enzyme
Mol. Mass.:
21608.82
Organism:
Mus musculus (Mouse)
Description:
Residue:
187
  
Inhibitor
Name:
BDBM50016322
Synonyms:
2-{4-[(2,4-Diamino-pyrido[2,3-d]pyrimidin-6-ylmethyl)-methyl-amino]-benzoylamino}-pentanedioic acid | CHEMBL262953
Type:
Small organic molecule
Emp. Form.:
C21H23N7O5
Mol. Mass.:
453.4512
SMILES:
CN(Cc1cnc2nc(N)nc(N)c2c1)c1ccc(cc1)C(=O)NC(CCC(O)=O)C(O)=O
: