Target
Aldo-keto reductase family 1 member B1
Ligand
BDBM50022186
Substrate
Meas. Tech.
ChEMBL_31926 (CHEMBL642969)
IC50
32000±n/a nM
Citation
 Brubaker, ANDeRuiter, JWhitmer, WL Synthesis and rat lens aldose reductase inhibitory activity of some benzopyran-2-ones. J Med Chem 29:1094-9 (1986)  
Target
Name:
Aldo-keto reductase family 1 member B1
Synonyms:
ALDR_RAT Akr1b4 Aldr1
Type:
PROTEIN
Mol. Mass.:
35797.87
Organism:
Rattus norvegicus
Description:
ChEMBL_1512484
Residue:
316
  
Inhibitor
Name:
BDBM50022186
Synonyms:
1-naphthaleneacetic acid CHEMBL428495 alpha-NAA naphthalen-1-ylacetic acid | naphthalene-1-acetic acid
Type:
Small organic molecule
Emp. Form.:
C12H10O2
Mol. Mass.:
186.2066
SMILES:
OC(=O)Cc1cccc2ccccc12
: