Target
Phenylethanolamine N-methyltransferase
Ligand
BDBM50024824
Substrate
Meas. Tech.
ChEBML_153309
Ki
90000±n/a nM
Citation
 Sall, DJGrunewald, GL Inhibition of phenylethanolamine N-methyltransferase (PNMT) by aromatic hydroxy-substituted 1,2,3,4,-tetrahydroisoquinolines: further studies on the hydrophilic pocket of the aromatic ring binding region of the active site. J Med Chem 30:2208-16 (1988)  
Target
Name:
Phenylethanolamine N-methyltransferase
Synonyms:
Noradrenaline N-methyltransferase PNMT_BOVIN | PNMTase
Type:
Enzyme
Mol. Mass.:
30916.97
Organism:
Bos taurus (bovine)
Description:
Residue:
283
  
Inhibitor
Name:
BDBM50024824
Synonyms:
1,2,3,4-Tetrahydro-isoquinolin-5-ol | CHEMBL308021
Type:
Small organic molecule
Emp. Form.:
C9H11NO
Mol. Mass.:
149.1897
SMILES:
Oc1cccc2CNCCc12
: