Target
Thromboxane-A synthase
Ligand
BDBM7962
Substrate
Meas. Tech.
ChEBML_210118
IC50
150±n/a nM
Citation
 Wright, WBTomcufcik, ASChan, PSMarsico, JWPress, JB Thromboxane synthetase inhibitors and antihypertensive agents. 4. N-[(1H-imidazol-1-yl)alkyl] derivatives of quinazoline-2,4(1H,3H)-diones, quinazolin-4(3H)-ones, and 1,2,3-benzotriazin-4(3H)-ones. J Med Chem 30:2277-83 (1988)  
Target
Name:
Thromboxane-A synthase
Synonyms:
Cyp5 Cytochrome P450 5A1 TXA synthase Tbxas1
Type:
PROTEIN
Mol. Mass.:
59971.80
Organism:
Rattus norvegicus
Description:
ChEMBL_209768
Residue:
533
  
Inhibitor
Name:
BDBM7962
Synonyms:
4-(2-Imidazol-1-yl-ethoxy)-benzoic acid; hydrochloride 4-[2-(1H-imidazol-1-yl)ethoxy]benzoic acid CHEMBL537708 dazoxiben
Type:
Small organic molecule
Emp. Form.:
C12H12N2O3
Mol. Mass.:
232.2353
SMILES:
OC(=O)c1ccc(OCCn2ccnc2)cc1
: