Target
Polyunsaturated fatty acid 5-lipoxygenase
Ligand
BDBM22372
Substrate
Meas. Tech.
ChEBML_3912
IC50
400±n/a nM
Citation
 Summers, JBMazdiyasni, HHolms, JHRatajczyk, JDDyer, RDCarter, GW Hydroxamic acid inhibitors of 5-lipoxygenase. J Med Chem 30:574-80 (1987)  
Target
Name:
Polyunsaturated fatty acid 5-lipoxygenase
Synonyms:
Alox5 LOX5_RAT
Type:
PROTEIN
Mol. Mass.:
78082.31
Organism:
Rattus norvegicus
Description:
ChEMBL_1432947
Residue:
673
  
Inhibitor
Name:
BDBM22372
Synonyms:
4-[(2R,3S)-4-(3,4-dihydroxyphenyl)-2,3-dimethylbutyl]benzene-1,2-diol CHEMBL313972 NDGA | Nordihydroguaiaretic Acid
Type:
Antioxidant
Emp. Form.:
C18H22O4
Mol. Mass.:
302.3649
SMILES:
C[C@@H](Cc1ccc(O)c(O)c1)[C@H](C)Cc1ccc(O)c(O)c1
: