Target
Adenosine deaminase
Ligand
BDBM50366815
Substrate
Meas. Tech.
ChEBML_30780
Ki
500000±n/a nM
Citation
 Nord, LDDalley, NKMcKernan, PARobins, RK Synthesis, structure, and biological activity of certain 2-deoxy-beta-D-ribo-hexopyranosyl nucleosides and nucleotides. J Med Chem 30:1044-54 (1987)  
Target
Name:
Adenosine deaminase
Synonyms:
ADA Adenosine aminohydrolase
Type:
Enzyme
Mol. Mass.:
40910.44
Organism:
Bos taurus (bovine)
Description:
Residue:
363
  
Inhibitor
Name:
BDBM50366815
Synonyms:
INO-1001 | INOSINE
Type:
Small organic molecule
Emp. Form.:
C10H12N4O5
Mol. Mass.:
268.2261
SMILES:
OC[C@H]1O[C@H]([C@H](O)[C@@H]1O)n1cnc2c1nc[nH]c2=O
: