Target
Kappa-type opioid receptor
Ligand
BDBM50019095
Substrate
Meas. Tech.
ChEBML_146073
Kd
830±n/a nM
Citation
 Lawson, JACheng, ADeGraw, JFrenking, GUyeno, EToll, LLoew, GH Effects of addition of a 2-methyl group to ethyl nipecotates (beta-meperidines) on receptor affinities and opiate agonist/antagonist activities. J Med Chem 31:2015-21 (1988)  
Target
Name:
Kappa-type opioid receptor
Synonyms:
Kappa Opioid Receptor OPRK1 Opiate Kappa 1 | mu/kappa opioid receptor
Type:
G Protein-Coupled Receptor (GPCR)
Mol. Mass.:
42744.99
Organism:
Cavia porcellus (domestic guinea pig)
Description:
P41144
Residue:
380
  
Inhibitor
Name:
BDBM50019095
Synonyms:
1-Allyl-3-(3-hydroxy-phenyl)-2-methyl-piperidine-3-carboxylic acid ethyl ester | CHEMBL300357
Type:
Small organic molecule
Emp. Form.:
C18H25NO3
Mol. Mass.:
303.396
SMILES:
CCOC(=O)[C@@]1(CCCN(CC=C)[C@H]1C)c1cccc(O)c1
: