Target
Adenosine receptor A1
Ligand
BDBM50023396
Substrate
Meas. Tech.
ChEMBL_28526 (CHEMBL640695)
IC50
37±n/a nM
Citation
 Linden, JPatel, AEarl, CQCraig, RHDaluge, SM 125I-labeled 8-phenylxanthine derivatives: antagonist radioligands for adenosine A1 receptors. J Med Chem 31:745-51 (1988)  
Target
Name:
Adenosine receptor A1
Synonyms:
AA1R_RAT ADENOSINE A1 high Adenosine A1 receptor (A1) Adenosine receptors A1 | Adora1
Type:
Protein
Mol. Mass.:
36704.13
Organism:
Rattus norvegicus (rat)
Description:
Residue:
326
  
Inhibitor
Name:
BDBM50023396
Synonyms:
(4-{3-[2-(4-Amino-phenyl)-ethyl]-2,6-dioxo-1-propyl-2,3,6,9-tetrahydro-1H-purin-8-yl}-phenoxy)-acetic acid | CHEMBL351481
Type:
Small organic molecule
Emp. Form.:
C24H25N5O5
Mol. Mass.:
463.4858
SMILES:
CCCn1c(=O)n(CCc2ccc(N)cc2)c2[nH]c(nc2c1=O)-c1ccc(OCC(O)=O)cc1
: