Target
Adenosine receptor A1
Ligand
BDBM25400
Substrate
Meas. Tech.
ChEBML_28549
IC50
11000±n/a nM
Citation
 Earl, CQPatel, ACraig, RHDaluge, SMLinden, J Photoaffinity labeling adenosine A1 receptors with an antagonist 125I-labeled aryl azide derivative of 8-phenylxanthine. J Med Chem 31:752-6 (1988)  
Target
Name:
Adenosine receptor A1
Synonyms:
AA1R_RAT ADENOSINE A1 high Adenosine A1 receptor (A1) Adenosine receptors A1 | Adora1
Type:
Protein
Mol. Mass.:
36704.13
Organism:
Rattus norvegicus (rat)
Description:
Residue:
326
  
Inhibitor
Name:
BDBM25400
Synonyms:
(2R,3R,4S,5R)-2-[6-(cyclopentylamino)-9H-purin-9-yl]-5-(hydroxymethyl)oxolane-3,4-diol CPA N6-cyclopentyladenosine (CPA) | cid_657378
Type:
Small organic molecule
Emp. Form.:
C15H21N5O4
Mol. Mass.:
335.3583
SMILES:
OC[C@H]1O[C@H]([C@H](O)[C@@H]1O)n1cnc2c(NC3CCCC3)ncnc12
: