Target
Adenosine receptor A1
Ligand
BDBM50023395
Substrate
Meas. Tech.
ChEMBL_28828 (CHEMBL648313)
Kd
1.2±n/a nM
Citation
 Earl, CQPatel, ACraig, RHDaluge, SMLinden, J Photoaffinity labeling adenosine A1 receptors with an antagonist 125I-labeled aryl azide derivative of 8-phenylxanthine. J Med Chem 31:752-6 (1988)  
Target
Name:
Adenosine receptor A1
Synonyms:
AA1R_RAT ADENOSINE A1 high Adenosine A1 receptor (A1) Adenosine receptors A1 | Adora1
Type:
Protein
Mol. Mass.:
36704.13
Organism:
Rattus norvegicus (rat)
Description:
Residue:
326
  
Inhibitor
Name:
BDBM50023395
Synonyms:
(4-{3-[2-(4-Azido-3-iodo-phenyl)-ethyl]-2,6-dioxo-1-propyl-2,3,6,9-tetrahydro-1H-purin-8-yl}-phenoxy)-acetic acid | CHEMBL164623
Type:
Small organic molecule
Emp. Form.:
C24H22IN7O5
Mol. Mass.:
615.3799
SMILES:
CCCn1c(=O)n(CCc2ccc(N=[N+]=[N-])c(I)c2)c2[nH]c(nc2c1=O)-c1ccc(OCC(O)=O)cc1
: