Target
Thymidylate synthase
Ligand
BDBM50023643
Substrate
Meas. Tech.
ChEBML_209138
Ki
5670±n/a nM
Citation
 Chang, GSchwepler, DDecedue, CJBalzarini, JDe Clercq, EMertes, MP Linear free energy relationship studies of enzyme active site binding: thymidylate synthase. J Med Chem 31:1141-7 (1988)  
Target
Name:
Thymidylate synthase
Synonyms:
TSase Thymidylate Synthase (TS) thyA
Type:
Enzyme
Mol. Mass.:
36576.54
Organism:
Lactobacillus casei
Description:
Residue:
316
  
Inhibitor
Name:
BDBM50023643
Synonyms:
CHEMBL3144195 | Phosphoric acid mono-{5-[5-(4-carbamoyl-phenyl)-2,4-dioxo-3,4-dihydro-2H-pyrimidin-1-yl]-3-hydroxy-tetrahydro-furan-2-ylmethyl} ester
Type:
Small organic molecule
Emp. Form.:
C16H18N3O9P
Mol. Mass.:
427.3026
SMILES:
NC(=O)c1ccc(cc1)-c1cn([C@H]2C[C@H](O)[C@@H](COP(O)(O)=O)O2)c(=O)[nH]c1=O
: