Target
Thymidine kinase
Ligand
BDBM50013094
Substrate
Meas. Tech.
ChEBML_207840
EC50
8000±n/a nM
Citation
 Focher, FHildebrand, CFreese, SCiarrocchi, GNoonan, TSangalli, SBrown, NSpadari, SWright, G N2-phenyldeoxyguanosine: a novel selective inhibitor of herpes simplex thymidine kinase. J Med Chem 31:1496-500 (1988)  
Target
Name:
Thymidine kinase
Synonyms:
KITH_HHV1S Thymidine kinase | UL23
Type:
PROTEIN
Mol. Mass.:
40883.42
Organism:
Human herpesvirus 1 (strain SC16) (HHV-1) (Human herpes simplex virus1)
Description:
ChEMBL_213
Residue:
376
  
Inhibitor
Name:
BDBM50013094
Synonyms:
2-Phenylamino-1,9-dihydro-purin-6-one CHEMBL287727
Type:
Small organic molecule
Emp. Form.:
C11H9N5O
Mol. Mass.:
227.2221
SMILES:
O=c1[nH]c(Nc2ccccc2)nc2nc[nH]c12
: