Target
Thymidine kinase
Ligand
BDBM50123607
Substrate
Meas. Tech.
ChEBML_207840
EC50
3000±n/a nM
Citation
 Focher, FHildebrand, CFreese, SCiarrocchi, GNoonan, TSangalli, SBrown, NSpadari, SWright, G N2-phenyldeoxyguanosine: a novel selective inhibitor of herpes simplex thymidine kinase. J Med Chem 31:1496-500 (1988)  
Target
Name:
Thymidine kinase
Synonyms:
KITH_HHV1S Thymidine kinase | UL23
Type:
PROTEIN
Mol. Mass.:
40883.42
Organism:
Human herpesvirus 1 (strain SC16) (HHV-1) (Human herpes simplex virus1)
Description:
ChEMBL_213
Residue:
376
  
Inhibitor
Name:
BDBM50123607
Synonyms:
CHEMBL3143943
Type:
Small organic molecule
Emp. Form.:
C16H18N5O7P
Mol. Mass.:
423.3172
SMILES:
O[C@H]1C[C@@H](O[C@@H]1COP(O)(O)=O)N1C=NC2C1=NC(Nc1ccccc1)=NC2=O
: