Target
Thymidine kinase
Ligand
BDBM50123606
Substrate
Meas. Tech.
ChEBML_207840
EC50
400000±n/a nM
Citation
 Focher, FHildebrand, CFreese, SCiarrocchi, GNoonan, TSangalli, SBrown, NSpadari, SWright, G N2-phenyldeoxyguanosine: a novel selective inhibitor of herpes simplex thymidine kinase. J Med Chem 31:1496-500 (1988)  
Target
Name:
Thymidine kinase
Synonyms:
KITH_HHV1S Thymidine kinase | UL23
Type:
PROTEIN
Mol. Mass.:
40883.42
Organism:
Human herpesvirus 1 (strain SC16) (HHV-1) (Human herpes simplex virus1)
Description:
ChEMBL_213
Residue:
376
  
Inhibitor
Name:
BDBM50123606
Synonyms:
CHEMBL3143941
Type:
Small organic molecule
Emp. Form.:
C20H26N5O7P
Mol. Mass.:
479.4235
SMILES:
CCCCc1ccc(NC2=NC(=O)C3N=CN([C@H]4C[C@H](O)[C@@H](COP(O)(O)=O)O4)C3=N2)cc1
: