Target
Thymidine kinase
Ligand
BDBM50405722
Substrate
Meas. Tech.
ChEBML_207840
EC50
75000±n/a nM
Citation
 Focher, FHildebrand, CFreese, SCiarrocchi, GNoonan, TSangalli, SBrown, NSpadari, SWright, G N2-phenyldeoxyguanosine: a novel selective inhibitor of herpes simplex thymidine kinase. J Med Chem 31:1496-500 (1988)  
Target
Name:
Thymidine kinase
Synonyms:
KITH_HHV1S Thymidine kinase | UL23
Type:
PROTEIN
Mol. Mass.:
40883.42
Organism:
Human herpesvirus 1 (strain SC16) (HHV-1) (Human herpes simplex virus1)
Description:
ChEMBL_213
Residue:
376
  
Inhibitor
Name:
BDBM50405722
Synonyms:
CHEMBL2092762
Type:
Small organic molecule
Emp. Form.:
C20H25N5O5
Mol. Mass.:
415.443
SMILES:
CCCCc1ccc(Nc2nc3n(cnc3c(=O)[nH]2)[C@H]2O[C@@H](CO)[C@H](O)[C@@H]2O)cc1
: