Target
Potassium-transporting ATPase alpha chain 1/subunit beta
Ligand
BDBM50367818
Substrate
Meas. Tech.
ChEMBL_164918 (CHEMBL872006)
IC50
250±n/a nM
Citation
 Sanfilippo, PJUrbanski, MPress, JBHajos, ZGShriver, DAScott, CK Synthesis of (aryloxy)alkylamines. 1. Novel antisecretory agents with H+K+-ATPase inhibitory activity. J Med Chem 31:1778-85 (1988)  
Target
Name:
Potassium-transporting ATPase alpha chain 1/subunit beta
Synonyms:
Potassium-transporting ATPase | Potassium-transporting ATPase alpha chain 1/beta chain
Type:
Mol. Mass.:
Description:
ASSAY_ID of EBI is 71495
Components:
This complex has 2 components.
Component 1
Name:
Potassium-transporting ATPase alpha chain 1
Synonyms:
ATP4A Gastric H(+)/K(+) ATPase subunit alpha Potassium-transporting ATPase alpha chain 1 | Proton pump
Type:
PROTEIN
Mol. Mass.:
114109.05
Organism:
Homo sapiens (Human)
Description:
EBI_82
Residue:
1035
  
Component 2
Name:
Potassium-transporting ATPase subunit beta
Synonyms:
ATP4B Gastric H(+)/K(+) ATPase subunit beta Potassium-transporting ATPase subunit beta | Proton pump beta chain
Type:
PROTEIN
Mol. Mass.:
33369.83
Organism:
Homo sapiens (Human)
Description:
EBI_10719
Residue:
291
  
Inhibitor
Name:
BDBM50367818
Synonyms:
CHEMBL1202608
Type:
Small organic molecule
Emp. Form.:
C21H19N3O2
Mol. Mass.:
345.3945
SMILES:
C(COc1ccc(\C=C\c2nc3ccccc3o2)cc1)Cn1ccnc1
: