Target
Sex hormone-binding globulin
Ligand
BDBM18161
Substrate
Meas. Tech.
ChEBML_226369
IC50
3.8±n/a nM
Citation
 Winneker, RCWagner, MMSingh, B A novel, nonsteroidal inhibitor of androgen binding to the rat androgen binding protein: diethyl [[[3-(2,6-dimethyl-4-pyridinyl)-4-fluorophenyl]amino]methylene] propanedioate. J Med Chem 33:129-32 (1990)  
Target
Name:
Sex hormone-binding globulin
Synonyms:
SHBG Testis-specific androgen-binding protein
Type:
PROTEIN
Mol. Mass.:
43780.19
Organism:
Homo sapiens (Human)
Description:
ChEMBL_466706
Residue:
402
  
Inhibitor
Name:
BDBM18161
Synonyms:
(1S,2S,7S,10R,11S,14S,15S)-14-hydroxy-2,15-dimethyltetracyclo[8.7.0.0^{2,7}.0^{11,15}]heptadecan-5-one CHEMBL27769 Dihydrotestosterone | [3H]DHT
Type:
Steroid
Emp. Form.:
C19H30O2
Mol. Mass.:
290.4403
SMILES:
[H][C@@]12CC[C@H](O)[C@@]1(C)CC[C@@]1([H])[C@@]2([H])CC[C@@]2([H])CC(=O)CC[C@]12C
: