Target
Angiotensin-converting enzyme
Ligand
BDBM50367929
Substrate
Meas. Tech.
ChEBML_35076
Ki
200±n/a nM
Citation
 Kortylewicz, ZPGalardy, RE Phosphoramidate peptide inhibitors of human skin fibroblast collagenase. J Med Chem 33:263-73 (1990)  
Target
Name:
Angiotensin-converting enzyme
Synonyms:
3.2.1.- ACE Angiotensin-converting enzyme, soluble form DCP1 Kininase II
Type:
Mol. Mass.:
150405.15
Organism:
Oryctolagus cuniculus
Description:
Residue:
1310
  
Inhibitor
Name:
BDBM50367929
Synonyms:
CHEMBL1744401
Type:
Small organic molecule
Emp. Form.:
C26H34N3O8P
Mol. Mass.:
547.5383
SMILES:
CCOP([O-])(=O)N[C@@H]([C@@H](C)CC)C(=O)NC(Cc1ccc(OCc2ccccc2)cc1)C(=O)NCC([O-])=O
: