Target
D(2) dopamine receptor
Ligand
BDBM50010580
Substrate
Meas. Tech.
ChEMBL_61589 (CHEMBL675761)
IC50
440±n/a nM
Citation
 Jaen, JCWise, LDCaprathe, BWTecle, HBergmeier, SHumblet, CCHeffner, TGMeltzer, LTPugsley, TA 4-(1,2,5,6-Tetrahydro-1-alkyl-3-pyridinyl)-2-thiazolamines: a novel class of compounds with central dopamine agonist properties. J Med Chem 33:311-7 (1990)  
Target
Name:
D(2) dopamine receptor
Synonyms:
DOPAMINE D2 DOPAMINE D2 Short Dopamine D2 receptor Drd2
Type:
G Protein-Coupled Receptor (GPCR)
Mol. Mass.:
50931.60
Organism:
Rattus norvegicus (rat)
Description:
P61169
Residue:
444
  
Inhibitor
Name:
BDBM50010580
Synonyms:
4-(1-Allyl-1,2,5,6-tetrahydro-pyridin-3-yl)-thiazol-2-ylamine | CHEMBL106257
Type:
Small organic molecule
Emp. Form.:
C11H15N3S
Mol. Mass.:
221.322
SMILES:
Nc1nc(cs1)C1=CCCN(CC=C)C1
: