Target
D(1A) dopamine receptor
Ligand
BDBM50007573
Substrate
Meas. Tech.
ChEBML_58332
IC50
>50000±n/a nM
Citation
 Jaen, JCWise, LDCaprathe, BWTecle, HBergmeier, SHumblet, CCHeffner, TGMeltzer, LTPugsley, TA 4-(1,2,5,6-Tetrahydro-1-alkyl-3-pyridinyl)-2-thiazolamines: a novel class of compounds with central dopamine agonist properties. J Med Chem 33:311-7 (1990)  
Target
Name:
D(1A) dopamine receptor
Synonyms:
DOPAMINE D1 Dopamine D1 high Dopamine receptor Dopamine1-like Drd1a
Type:
Enzyme Catalytic Domain
Mol. Mass.:
49429.75
Organism:
RAT
Description:
P18901
Residue:
446
  
Inhibitor
Name:
BDBM50007573
Synonyms:
4-(1-Propyl-1,2,5,6-tetrahydro-pyridin-3-yl)-thiazol-2-ylamine | CHEMBL93428
Type:
Small organic molecule
Emp. Form.:
C11H17N3S
Mol. Mass.:
223.338
SMILES:
CCCN1CCC=C(C1)c1csc(N)n1
: