Target
D(2) dopamine receptor
Ligand
BDBM50010575
Substrate
Meas. Tech.
ChEMBL_61591 (CHEMBL675763)
IC50
>1000±n/a nM
Citation
 Jaen, JCWise, LDCaprathe, BWTecle, HBergmeier, SHumblet, CCHeffner, TGMeltzer, LTPugsley, TA 4-(1,2,5,6-Tetrahydro-1-alkyl-3-pyridinyl)-2-thiazolamines: a novel class of compounds with central dopamine agonist properties. J Med Chem 33:311-7 (1990)  
Target
Name:
D(2) dopamine receptor
Synonyms:
DOPAMINE D2 DOPAMINE D2 Short Dopamine D2 receptor Drd2
Type:
G Protein-Coupled Receptor (GPCR)
Mol. Mass.:
50931.60
Organism:
Rattus norvegicus (rat)
Description:
P61169
Residue:
444
  
Inhibitor
Name:
BDBM50010575
Synonyms:
5-(1-Propyl-1,2,5,6-tetrahydro-pyridin-3-yl)-3H-1lambda*4*-thiazol-2-ylamine | CHEMBL322978
Type:
Small organic molecule
Emp. Form.:
C11H17N3S
Mol. Mass.:
223.338
SMILES:
CCCN1CCC=C(C1)c1cnc(N)s1
: