Target
Prostaglandin G/H synthase 1/2
Ligand
BDBM22372
Substrate
Meas. Tech.
ChEMBL_157965 (CHEMBL767495)
IC50
14000±n/a nM
Citation
 Batt, DGMaynard, GDPetraitis, JJShaw, JEGalbraith, WHarris, RR 2-substituted-1-naphthols as potent 5-lipoxygenase inhibitors with topical antiinflammatory activity. J Med Chem 33:360-70 (1990)  
Target
Name:
Prostaglandin G/H synthase 1/2
Synonyms:
Cyclooxygenase
Type:
Mol. Mass.:
Description:
ASSAY_ID of ChEMBL is 1570295
Components:
This complex has 2 components.
Component 1
Name:
Prostaglandin G/H synthase 2
Synonyms:
COX2 Cyclooxygenase-2 PGH2_BOVIN PHS II Prostaglandin H2 synthase 2 | Prostaglandin-endoperoxide synthase 2
Type:
PROTEIN
Mol. Mass.:
69173.20
Organism:
Bos taurus
Description:
ChEMBL_157990
Residue:
604
  
Component 2
Name:
Prostaglandin G/H synthase 1
Synonyms:
COX-1 Cyclooxygenase PGH1_BOVIN | PTGS1
Type:
PROTEIN
Mol. Mass.:
68814.10
Organism:
Bos taurus
Description:
ChEMBL_547440
Residue:
600
  
Inhibitor
Name:
BDBM22372
Synonyms:
4-[(2R,3S)-4-(3,4-dihydroxyphenyl)-2,3-dimethylbutyl]benzene-1,2-diol CHEMBL313972 NDGA | Nordihydroguaiaretic Acid
Type:
Antioxidant
Emp. Form.:
C18H22O4
Mol. Mass.:
302.3649
SMILES:
C[C@@H](Cc1ccc(O)c(O)c1)[C@H](C)Cc1ccc(O)c(O)c1
: